Target
Cytochrome P450 2C19
Ligand
BDBM50188302
Substrate
Meas. Tech.
ChEMBL_378648 (CHEMBL853469)
IC50
1600±n/a nM
Citation
 Birkinshaw, TNTeague, SJBeech, CBonnert, RVHill, SPatel, AReakes, SSanganee, HDougall, IGPhillips, TTSalter, SSchmidt, JArrowsmith, ECCarrillo, JJBell, FMPaine, SWWeaver, R Discovery of potent CRTh2 (DP2) receptor antagonists. Bioorg Med Chem Lett 16:4287-90 (2006)  
Target
Name:
Cytochrome P450 2C19
Synonyms:
(R)-limonene 6-monooxygenase (S)-limonene 7-monooxygenase CYP2C19 CYPIIC19 Cytochrome P450 2C19 [I331V] Cytochrome P450-254C Mephenytoin 4-hydroxylase P450-254C
Type:
Enzyme
Mol. Mass.:
55935.47
Organism:
Homo sapiens (Human)
Description:
P33261
Residue:
490
  
Inhibitor
Name:
BDBM50188302
Synonyms:
2-(1-(7-chloroquinolin-4-yl)-5-methoxy-2-methyl-1H-indol-3-yl)acetic acid | CHEMBL213029
Type:
Small organic molecule
Emp. Form.:
C21H17ClN2O3
Mol. Mass.:
380.824
SMILES:
COc1ccc2n(c(C)c(CC(O)=O)c2c1)-c1ccnc2cc(Cl)ccc12
: