Target
Sodium-dependent serotonin transporter
Ligand
BDBM50188301
Substrate
Meas. Tech.
ChEMBL_378651 (CHEMBL853472)
IC50
2000±n/a nM
Citation
 Birkinshaw, TNTeague, SJBeech, CBonnert, RVHill, SPatel, AReakes, SSanganee, HDougall, IGPhillips, TTSalter, SSchmidt, JArrowsmith, ECCarrillo, JJBell, FMPaine, SWWeaver, R Discovery of potent CRTh2 (DP2) receptor antagonists. Bioorg Med Chem Lett 16:4287-90 (2006)  
Target
Name:
Sodium-dependent serotonin transporter
Synonyms:
5-HT Transporter 5HT transporter Anandamid membrane transporter, AMT Monoamine transporters; Norepinephrine & serotonin Slc6a4 Sodium-dependent serotonin transporter (SERT) | imipramine receptor
Type:
Multi-pass membrane protein
Mol. Mass.:
70168.43
Organism:
Rattus norvegicus (rat)
Description:
P31652
Residue:
630
  
Inhibitor
Name:
BDBM50188301
Synonyms:
2-(2,5-dimethyl-3-(8-methylquinolin-4-yl)-1H-indol-1-yl)acetic acid | CHEMBL209689
Type:
Small organic molecule
Emp. Form.:
C22H20N2O2
Mol. Mass.:
344.4064
SMILES:
Cc1c(-c2ccnc3c(C)cccc23)c2cc(C)ccc2n1CC(O)=O
: