Target
Cytochrome P450 2C9
Ligand
BDBM50188301
Substrate
Meas. Tech.
ChEMBL_378649 (CHEMBL853470)
IC50
5000±n/a nM
Citation
 Birkinshaw, TNTeague, SJBeech, CBonnert, RVHill, SPatel, AReakes, SSanganee, HDougall, IGPhillips, TTSalter, SSchmidt, JArrowsmith, ECCarrillo, JJBell, FMPaine, SWWeaver, R Discovery of potent CRTh2 (DP2) receptor antagonists. Bioorg Med Chem Lett 16:4287-90 (2006)  
Target
Name:
Cytochrome P450 2C9
Synonyms:
(R)-limonene 6-monooxygenase CP2C9_HUMAN CYP2C9 Cytochrome P450 2C9 (CYP2C9 ) P-450MP P450 PB-1 | S-mephenytoin 4-hydroxylase
Type:
Enzyme
Mol. Mass.:
55636.33
Organism:
Homo sapiens (Human)
Description:
P11712
Residue:
490
  
Inhibitor
Name:
BDBM50188301
Synonyms:
2-(2,5-dimethyl-3-(8-methylquinolin-4-yl)-1H-indol-1-yl)acetic acid | CHEMBL209689
Type:
Small organic molecule
Emp. Form.:
C22H20N2O2
Mol. Mass.:
344.4064
SMILES:
Cc1c(-c2ccnc3c(C)cccc23)c2cc(C)ccc2n1CC(O)=O
: