Target
Cytochrome P450 2C19
Ligand
BDBM50188301
Substrate
Meas. Tech.
ChEMBL_378648 (CHEMBL853469)
IC50
2500±n/a nM
Citation
 Birkinshaw, TNTeague, SJBeech, CBonnert, RVHill, SPatel, AReakes, SSanganee, HDougall, IGPhillips, TTSalter, SSchmidt, JArrowsmith, ECCarrillo, JJBell, FMPaine, SWWeaver, R Discovery of potent CRTh2 (DP2) receptor antagonists. Bioorg Med Chem Lett 16:4287-90 (2006)  
Target
Name:
Cytochrome P450 2C19
Synonyms:
(R)-limonene 6-monooxygenase (S)-limonene 7-monooxygenase CYP2C19 CYPIIC19 Cytochrome P450 2C19 [I331V] Cytochrome P450-254C Mephenytoin 4-hydroxylase P450-254C
Type:
Enzyme
Mol. Mass.:
55935.47
Organism:
Homo sapiens (Human)
Description:
P33261
Residue:
490
  
Inhibitor
Name:
BDBM50188301
Synonyms:
2-(2,5-dimethyl-3-(8-methylquinolin-4-yl)-1H-indol-1-yl)acetic acid | CHEMBL209689
Type:
Small organic molecule
Emp. Form.:
C22H20N2O2
Mol. Mass.:
344.4064
SMILES:
Cc1c(-c2ccnc3c(C)cccc23)c2cc(C)ccc2n1CC(O)=O
: