Target
Low molecular weight phosphotyrosine protein phosphatase
Ligand
BDBM50607138
Substrate
Meas. Tech.
ChEMBL_2262142 (CHEMBL5217153)
IC50
49±n/a nM
Citation
 He, RWang, JYu, ZHMoyers, JSMichael, MDDurham, TBCramer, JWQian, YLin, AWu, LNoinaj, NBarrett, DGZhang, ZY Structure-Based Design of Active-Site-Directed, Highly Potent, Selective, and Orally Bioavailable Low-Molecular-Weight Protein Tyrosine Phosphatase Inhibitors. J Med Chem 65:13892-13909 (2022) Target
Name:
Low molecular weight phosphotyrosine protein phosphatase
Synonyms:
3.1.3.2 ACP1 LMW-PTP LMWPTP PPAC_HUMAN low molecular weight phosphotyrosine protein phosphatase isoform c
Type:
Mol. Mass.:
18042.81
Organism:
Homo sapiens (Human)
Description:
P24666
Residue:
158
  
Inhibitor
Name:
BDBM50607138
Synonyms:
CHEMBL5218783
Type:
Small organic molecule
Emp. Form.:
C4H8N4O4S2
Mol. Mass.:
240.261
SMILES:
N.OS(=O)(=O)NC(=O)Nc1nccs1
: