Target
RNA polymerase II subunit A C-terminal domain phosphatase SSU72
Ligand
BDBM50607110
Substrate
Meas. Tech.
ChEMBL_2262156 (CHEMBL5217167)
IC50
>100000±n/a nM
Citation
 He, RWang, JYu, ZHMoyers, JSMichael, MDDurham, TBCramer, JWQian, YLin, AWu, LNoinaj, NBarrett, DGZhang, ZY Structure-Based Design of Active-Site-Directed, Highly Potent, Selective, and Orally Bioavailable Low-Molecular-Weight Protein Tyrosine Phosphatase Inhibitors. J Med Chem 65:13892-13909 (2022) Target
Name:
RNA polymerase II subunit A C-terminal domain phosphatase SSU72
Synonyms:
CTD phosphatase SSU72 RNA polymerase II subunit A C-terminal domain phosphatase SSU72 SSU72_HUMAN
Type:
Enzyme
Mol. Mass.:
22567.68
Organism:
Homo sapiens (Human)
Description:
Q9NP77
Residue:
194
  
Inhibitor
Name:
BDBM50607110
Synonyms:
CHEMBL5219519
Type:
Small organic molecule
Emp. Form.:
C9H9Br2NO4S
Mol. Mass.:
387.045
SMILES:
Cc1c(Br)cc(NC(=O)CS(O)(=O)=O)cc1Br
: