Target
Low molecular weight phosphotyrosine protein phosphatase
Ligand
BDBM50558488
Substrate
Meas. Tech.
ChEMBL_2262188 (CHEMBL5217199)
IC50
300±n/a nM
Citation
 He, RWang, JYu, ZHMoyers, JSMichael, MDDurham, TBCramer, JWQian, YLin, AWu, LNoinaj, NBarrett, DGZhang, ZY Structure-Based Design of Active-Site-Directed, Highly Potent, Selective, and Orally Bioavailable Low-Molecular-Weight Protein Tyrosine Phosphatase Inhibitors. J Med Chem 65:13892-13909 (2022) Target
Name:
Low molecular weight phosphotyrosine protein phosphatase
Synonyms:
3.1.3.2 Acp1 LMW-PTPase PPAC_RAT
Type:
PROTEIN
Mol. Mass.:
18151.43
Organism:
Rattus norvegicus
Description:
ChEMBL_120671
Residue:
158
  
Inhibitor
Name:
BDBM50558488
Synonyms:
CHEMBL4794972
Type:
Small organic molecule
Emp. Form.:
C15H13Br2NO4S
Mol. Mass.:
463.141
SMILES:
Cc1c(Br)cc(NC(=O)C(c2ccccc2)S(O)(=O)=O)cc1Br
: