Target
Proteinase-activated receptor 1
Ligand
BDBM50191035
Substrate
Meas. Tech.
ChEMBL_401364 (CHEMBL854222)
IC50
3750±n/a nM
Citation
 Xia, YChackalamannil, SChan, TMCzarniecki, MDoller, DEagen, KGreenlee, WJTsai, HWang, YAhn, HSBoykow, GCMcPhail, AT Himbacine derived thrombin receptor (PAR-1) antagonists: structure-activity relationship of the lactone ring. Bioorg Med Chem Lett 16:4969-72 (2006)  
Target
Name:
Proteinase-activated receptor 1
Synonyms:
CF2R F2R PAR1 Proteinase activated receptor 1 TR Thrombin receptor/ Proteinase-activated receptor 1(Par-1)
Type:
Protein
Mol. Mass.:
47450.07
Organism:
Homo sapiens (Human)
Description:
P25116
Residue:
425
  
Inhibitor
Name:
BDBM50191035
Synonyms:
(R)-1-((1S,2S,3R,4aS,8aR)-1-(2-(6-ethylpyridin-2-yl)vinyl)-3-(hydroxymethyl)-decahydronaphthalen-2-yl)ethanol | CHEMBL214956
Type:
Small organic molecule
Emp. Form.:
C22H33NO2
Mol. Mass.:
343.5029
SMILES:
CCc1cccc(\C=C\[C@H]2[C@@H]3CCCC[C@H]3C[C@@H](CO)[C@H]2[C@@H](C)O)n1
: