Target
Proteinase-activated receptor 1
Ligand
BDBM50191038
Substrate
Meas. Tech.
ChEMBL_401364 (CHEMBL854222)
IC50
3500±n/a nM
Citation
 Xia, YChackalamannil, SChan, TMCzarniecki, MDoller, DEagen, KGreenlee, WJTsai, HWang, YAhn, HSBoykow, GCMcPhail, AT Himbacine derived thrombin receptor (PAR-1) antagonists: structure-activity relationship of the lactone ring. Bioorg Med Chem Lett 16:4969-72 (2006)  
Target
Name:
Proteinase-activated receptor 1
Synonyms:
CF2R F2R PAR1 Proteinase activated receptor 1 TR Thrombin receptor/ Proteinase-activated receptor 1(Par-1)
Type:
Protein
Mol. Mass.:
47450.07
Organism:
Homo sapiens (Human)
Description:
P25116
Residue:
425
  
Inhibitor
Name:
BDBM50191038
Synonyms:
(1R,3R,3aS,4S,4aR,8aS,9aR)-4-(2-(6-ethylpyridin-2-yl)vinyl)-3-methyl-dodecahydronaphtho[2,3-c]furan-1-ol | CHEMBL377378
Type:
Small organic molecule
Emp. Form.:
C22H31NO2
Mol. Mass.:
341.487
SMILES:
CCc1cccc(\C=C\[C@@H]2[C@@H]3[C@@H](C)O[C@@H](O)[C@@H]3C[C@@H]3CCCC[C@@H]23)n1
: