Target
Proteinase-activated receptor 1
Ligand
BDBM50191039
Substrate
Meas. Tech.
ChEMBL_401364 (CHEMBL854222)
IC50
623±n/a nM
Citation
 Xia, YChackalamannil, SChan, TMCzarniecki, MDoller, DEagen, KGreenlee, WJTsai, HWang, YAhn, HSBoykow, GCMcPhail, AT Himbacine derived thrombin receptor (PAR-1) antagonists: structure-activity relationship of the lactone ring. Bioorg Med Chem Lett 16:4969-72 (2006)  
Target
Name:
Proteinase-activated receptor 1
Synonyms:
CF2R F2R PAR1 Proteinase activated receptor 1 TR Thrombin receptor/ Proteinase-activated receptor 1(Par-1)
Type:
Protein
Mol. Mass.:
47450.07
Organism:
Homo sapiens (Human)
Description:
P25116
Residue:
425
  
Inhibitor
Name:
BDBM50191039
Synonyms:
6-methoxy-2-(2-((3R,3aS,4S,4aR,8aS,9aR)-3-methyl-dodecahydronaphtho[2,3-c]furan-4-yl)vinyl)quinoline | CHEMBL377594
Type:
Small organic molecule
Emp. Form.:
C25H31NO2
Mol. Mass.:
377.5191
SMILES:
COc1ccc2nc(\C=C\[C@@H]3[C@H]4[C@H](CO[C@@H]4C)C[C@@H]4CCCC[C@@H]34)ccc2c1
: