Target
Proteinase-activated receptor 1
Ligand
BDBM50191040
Substrate
Meas. Tech.
ChEMBL_401364 (CHEMBL854222)
IC50
7000±n/a nM
Citation
 Xia, YChackalamannil, SChan, TMCzarniecki, MDoller, DEagen, KGreenlee, WJTsai, HWang, YAhn, HSBoykow, GCMcPhail, AT Himbacine derived thrombin receptor (PAR-1) antagonists: structure-activity relationship of the lactone ring. Bioorg Med Chem Lett 16:4969-72 (2006)  
Target
Name:
Proteinase-activated receptor 1
Synonyms:
CF2R F2R PAR1 Proteinase activated receptor 1 TR Thrombin receptor/ Proteinase-activated receptor 1(Par-1)
Type:
Protein
Mol. Mass.:
47450.07
Organism:
Homo sapiens (Human)
Description:
P25116
Residue:
425
  
Inhibitor
Name:
BDBM50191040
Synonyms:
2-(2-((1S,4aS,8aR)-decahydronaphthalen-1-yl)vinyl)-6-methoxyquinoline | CHEMBL425437
Type:
Small organic molecule
Emp. Form.:
C22H27NO
Mol. Mass.:
321.4559
SMILES:
COc1ccc2nc(\C=C\[C@@H]3CCC[C@@H]4CCCC[C@@H]34)ccc2c1
: