Target
Proteinase-activated receptor 1
Ligand
BDBM50173425
Substrate
Meas. Tech.
ChEMBL_401364 (CHEMBL854222)
IC50
300±n/a nM
Citation
 Xia, YChackalamannil, SChan, TMCzarniecki, MDoller, DEagen, KGreenlee, WJTsai, HWang, YAhn, HSBoykow, GCMcPhail, AT Himbacine derived thrombin receptor (PAR-1) antagonists: structure-activity relationship of the lactone ring. Bioorg Med Chem Lett 16:4969-72 (2006)  
Target
Name:
Proteinase-activated receptor 1
Synonyms:
CF2R F2R PAR1 Proteinase activated receptor 1 TR Thrombin receptor/ Proteinase-activated receptor 1(Par-1)
Type:
Protein
Mol. Mass.:
47450.07
Organism:
Homo sapiens (Human)
Description:
P25116
Residue:
425
  
Inhibitor
Name:
BDBM50173425
Synonyms:
(3R,3aS,4S,4aR,8aS,9aR)-3-Methyl-4-[(E)-2-(6-methyl-pyridin-2-yl)-vinyl]-decahydro-naphtho[2,3-c]furan-1-one CHEMBL196727
Type:
Small organic molecule
Emp. Form.:
C21H27NO2
Mol. Mass.:
325.4446
SMILES:
C[C@H]1OC(=O)[C@@H]2C[C@@H]3CCCC[C@H]3[C@H](\C=C\c3cccc(C)n3)[C@H]12
: