Target
Proteinase-activated receptor 1
Ligand
BDBM50191051
Substrate
Meas. Tech.
ChEMBL_401364 (CHEMBL854222)
IC50
2000±n/a nM
Citation
 Xia, YChackalamannil, SChan, TMCzarniecki, MDoller, DEagen, KGreenlee, WJTsai, HWang, YAhn, HSBoykow, GCMcPhail, AT Himbacine derived thrombin receptor (PAR-1) antagonists: structure-activity relationship of the lactone ring. Bioorg Med Chem Lett 16:4969-72 (2006)  
Target
Name:
Proteinase-activated receptor 1
Synonyms:
CF2R F2R PAR1 Proteinase activated receptor 1 TR Thrombin receptor/ Proteinase-activated receptor 1(Par-1)
Type:
Protein
Mol. Mass.:
47450.07
Organism:
Homo sapiens (Human)
Description:
P25116
Residue:
425
  
Inhibitor
Name:
BDBM50191051
Synonyms:
(1R,3R,3aS,4S,4aR,8aS,9aR)-3-methyl-4-(2-(quinolin-2-yl)vinyl)-dodecahydronaphtho[2,3-c]furan-1-ol | CHEMBL215837
Type:
Small organic molecule
Emp. Form.:
C24H29NO2
Mol. Mass.:
363.4926
SMILES:
C[C@H]1O[C@@H](O)[C@@H]2C[C@@H]3CCCC[C@H]3[C@H](\C=C\c3ccc4ccccc4n3)[C@H]12
: