Target
Proteinase-activated receptor 1
Ligand
BDBM50179569
Substrate
Meas. Tech.
ChEMBL_401364 (CHEMBL854222)
IC50
15±n/a nM
Citation
 Xia, YChackalamannil, SChan, TMCzarniecki, MDoller, DEagen, KGreenlee, WJTsai, HWang, YAhn, HSBoykow, GCMcPhail, AT Himbacine derived thrombin receptor (PAR-1) antagonists: structure-activity relationship of the lactone ring. Bioorg Med Chem Lett 16:4969-72 (2006)  
Target
Name:
Proteinase-activated receptor 1
Synonyms:
CF2R F2R PAR1 Proteinase activated receptor 1 TR Thrombin receptor/ Proteinase-activated receptor 1(Par-1)
Type:
Protein
Mol. Mass.:
47450.07
Organism:
Homo sapiens (Human)
Description:
P25116
Residue:
425
  
Inhibitor
Name:
BDBM50179569
Synonyms:
(+/-)-(3R,3aS,4S,4aR,8aS,9aR)-4-(2-(6-methoxyquinolin-2-yl)vinyl)-3-methyl-decahydronaphtho[2,3-c]furan-1(3H)-one CHEMBL206502
Type:
Small organic molecule
Emp. Form.:
C25H29NO3
Mol. Mass.:
391.5027
SMILES:
COc1ccc2nc(\C=C\[C@@H]3[C@@H]4[C@@H](C)OC(=O)[C@@H]4C[C@@H]4CCCC[C@@H]34)ccc2c1
: