Target
Histone acetyltransferase p300
Ligand
BDBM50607602
Substrate
Meas. Tech.
ChEMBL_2262983 (CHEMBL5217994)
IC50
0.079433±n/a nM
Citation
 Tian, XSuarez, DThomson, DLi, WKing, EALaFrance, LBoehm, JBarton, LDi Marco, CMartyr, CThalji, RMedina, JKnight, SHeerding, DGao, ENartey, ECecconie, TNixon, CZhang, GBerrodin, TJPhelps, CPatel, ABai, XLind, KPrabhu, NMesser, JZhu, ZShewchuk, LReid, RGraves, APMcHugh, CMangatt, B Discovery of Proline-Based p300/CBP Inhibitors Using DNA-Encoded Library Technology in Combination with High-Throughput Screening. J Med Chem 65:14391-14408 (2022) Target
Name:
Histone acetyltransferase p300
Synonyms:
EP300 HIF1A/p300/CREB-binding protein P300
Type:
Protein
Mol. Mass.:
264223.04
Organism:
Homo sapiens (Human)
Description:
Q09472
Residue:
2414
  
Inhibitor
Name:
BDBM50607602
Synonyms:
CHEMBL5220994
Type:
Small organic molecule
Emp. Form.:
C22H19ClF3N5O2
Mol. Mass.:
477.867
SMILES:
F[C@@H]1C[C@@H](N(C1)C(=O)C1(CC(F)(F)C1)c1ccc(Cl)cc1)C(=O)Nc1ccc2[nH]ncc2n1
: