Target
Peroxisome proliferator-activated receptor gamma
Ligand
BDBM50191612
Substrate
Meas. Tech.
ChEMBL_376271 (CHEMBL854480)
EC50
50±n/a nM
Citation
 Ahn, JHShin, MSJung, SHKang, SKKim, KRRhee, SDJung, WHYang, SDKim, SJWoo, JRLee, JHCheon, HGKim, SS Indenone derivatives: a novel template for peroxisome proliferator-activated receptor gamma (PPARgamma) agonists. J Med Chem 49:4781-4 (2006)  
Target
Name:
Peroxisome proliferator-activated receptor gamma
Synonyms:
NR1C3 PPAR-gamma PPARG_HUMAN Peroxisome proliferator-activated receptor gamma (PPAR gamma) Peroxisome proliferator-activated receptor gamma (PPARĪ³) peroxisome proliferator-activated receptor gamma isoform 2
Type:
Nuclear Receptor
Mol. Mass.:
57613.46
Organism:
Homo sapiens (Human)
Description:
P37231
Residue:
505
  
Inhibitor
Name:
BDBM50191612
Synonyms:
1-oxo-3-phenyl-6-(3-phenylpropoxy)-1H-indene-2-carboxylicacid ethyl ester | CHEMBL210162
Type:
Small organic molecule
Emp. Form.:
C27H24O4
Mol. Mass.:
412.4771
SMILES:
CCOC(=O)C1=C(c2ccc(OCCCc3ccccc3)cc2C1=O)c1ccccc1
: