Target
Apoptosis regulator Bcl-2
Ligand
BDBM50196034
Substrate
Meas. Tech.
ChEMBL_416888 (CHEMBL909444)
Ki
11±n/a nM
Citation
 Wang, GNikolovska-Coleska, ZYang, CYWang, RTang, GGuo, JShangary, SQiu, SGao, WYang, DMeagher, JStuckey, JKrajewski, KJiang, SRoller, PPAbaan, HOTomita, YWang, S Structure-based design of potent small-molecule inhibitors of anti-apoptotic Bcl-2 proteins. J Med Chem 49:6139-42 (2006)  
Target
Name:
Apoptosis regulator Bcl-2
Synonyms:
Apoptosis regulator Bcl-2 Protein BCL-2 BCL2_HUMAN | Bcl-2 Protein
Type:
Homodimer or heterodimer
Mol. Mass.:
26269.11
Organism:
Homo sapiens (Human)
Description:
P10415
Residue:
239
  
Inhibitor
Name:
BDBM50196034
Synonyms:
CHEMBL410802 | QEDIIRNIARHLAQVGDSMDR
Type:
Small organic molecule
Emp. Form.:
C100H169N35O34S
Mol. Mass.:
2437.691
SMILES:
CC[C@H](C)[C@H](NC(=O)[C@H](CC(N)=O)NC(=O)[C@H](CCCN=C(N)N)NC(=O)[C@@H](NC(=O)[C@@H](NC(=O)[C@H](CC(O)=O)NC(=O)[C@H](CCC(O)=O)NC(=O)[C@@H](N)CCC(N)=O)[C@@H](C)CC)[C@@H](C)CC)C(=O)N[C@@H](C)C(=O)N[C@@H](CCCN=C(N)N)C(=O)N[C@@H](Cc1cnc[nH]1)C(=O)N[C@@H](CC(C)C)C(=O)N[C@@H](C)C(=O)N[C@@H](CCC(N)=O)C(=O)N[C@@H](C(C)C)C(=O)NCC(=O)N[C@@H](CC(O)=O)C(=O)N[C@@H](CO)C(=O)N[C@@H](CCSC)C(=O)N[C@@H](CC(O)=O)C(=O)N[C@@H](CCCN=C(N)N)C(O)=O
: