Target
Apoptosis regulator Bcl-2
Ligand
BDBM50196032
Substrate
Meas. Tech.
ChEMBL_416888 (CHEMBL909444)
Ki
290±n/a nM
Citation
 Wang, GNikolovska-Coleska, ZYang, CYWang, RTang, GGuo, JShangary, SQiu, SGao, WYang, DMeagher, JStuckey, JKrajewski, KJiang, SRoller, PPAbaan, HOTomita, YWang, S Structure-based design of potent small-molecule inhibitors of anti-apoptotic Bcl-2 proteins. J Med Chem 49:6139-42 (2006)  
Target
Name:
Apoptosis regulator Bcl-2
Synonyms:
Apoptosis regulator Bcl-2 Protein BCL-2 BCL2_HUMAN | Bcl-2 Protein
Type:
Homodimer or heterodimer
Mol. Mass.:
26269.11
Organism:
Homo sapiens (Human)
Description:
P10415
Residue:
239
  
Inhibitor
Name:
BDBM50196032
Synonyms:
(N-[(2-tert-butylbenzenesulfonyl)phenyl]-2,3,4-trihydroxy-5-(2-isopropylbenzyl)benzamide N-[(2-tert-butyl-benzenesulfonyl)-phenyl]-2,3,4-trihydroxy-5-(2-isopropyl-benzyl)-benzamide | TW-37
Type:
Small organic molecule
Emp. Form.:
C33H35NO6S
Mol. Mass.:
573.699
SMILES:
CC(C)c1ccccc1Cc1cc(C(=O)Nc2ccc(cc2)S(=O)(=O)c2ccccc2C(C)(C)C)c(O)c(O)c1O
: