Target
Potassium voltage-gated channel subfamily H member 2
Ligand
BDBM50201273
Substrate
Meas. Tech.
ChEMBL_420606 (CHEMBL854891)
IC50
11200±n/a nM
Citation
 Souers, AJIyengar, RRJudd, ASBeno, DWGao, JZhao, GBrune, MENapier, JJMulhern, MMLynch, JKFreeman, JCWodka, DChen, CJFalls, HDBrodjian, SDayton, BDDiaz, GJBush, ENShapiro, RDroz, BAKnourek-Segel, VHernandez, LEMarsh, KCReilly, RMSham, HLCollins, CAKym, PR Constrained 7-fluorocarboxychromone-4-aminopiperidine based Melanin-concentrating hormone receptor 1 antagonists: the effects of chirality on substituted indan-1-ylamines. Bioorg Med Chem Lett 17:884-9 (2007)  
Target
Name:
Potassium voltage-gated channel subfamily H member 2
Synonyms:
1,3-beta-glucan synthase component GLS2 ERG Eag-related protein 1 Ether-a-go-go-related gene (HERG) Ether-a-go-go-related gene potassium channel 1 Ether-a-go-go-related gene potassium channel 1 (hERG1) Ether-a-go-go-related protein 1 H-ERG KCNH2 Potassium voltage-gated channel subfamily H member 2 (hERG) Voltage-gated potassium channel subunit Kv11.1 hERG Potassium Channel 1 | putative potassium channel subunit
Type:
Multi-pass membrane protein
Mol. Mass.:
126672.65
Organism:
Homo sapiens (Human)
Description:
Q12809
Residue:
1159
  
Inhibitor
Name:
BDBM50201273
Synonyms:
CHEMBL214585 | N-(1-(6,7-dihydro-5H-indeno[5,6-d][1,3]dioxol-5-yl)piperidin-4-yl)-6-fluoro-4-oxo-4H-chromene-2-carboxamide
Type:
Small organic molecule
Emp. Form.:
C25H23FN2O5
Mol. Mass.:
450.4589
SMILES:
Fc1ccc2oc(cc(=O)c2c1)C(=O)NC1CCN(CC1)C1CCc2cc3OCOc3cc12
: