Target
Metabotropic glutamate receptor 5
Ligand
BDBM86716
Substrate
Meas. Tech.
ChEMBL_453951 (CHEMBL885955)
IC50
61±n/a nM
Citation
 Jaeschke, GPorter, RBüttelmann, BCeccarelli, SMGuba, WKuhn, BKolczewski, SHuwyler, JMutel, VPeters, JUBallard, TPrinssen, EVieira, EWichmann, JSpooren, W Synthesis and biological evaluation of fenobam analogs as mGlu5 receptor antagonists. Bioorg Med Chem Lett 17:1307-11 (2007)  
Target
Name:
Metabotropic glutamate receptor 5
Synonyms:
GPRC1E GRM5_HUMAN metabotropic glutamate 5 | metabotropic glutamate 5a
Type:
Enzyme
Mol. Mass.:
132484.72
Organism:
Homo sapiens (Human)
Description:
Residue:
1212
  
Inhibitor
Name:
BDBM86716
Synonyms:
CAS_63540-28-3 Fenobam | NSC_216215
Type:
Small organic molecule
Emp. Form.:
C11H11ClN4O2
Mol. Mass.:
266.684
SMILES:
Cn1cc(O)nc1NC(=O)Nc1cccc(Cl)c1
: