Target
A disintegrin and metalloproteinase with thrombospondin motifs 5
Ligand
BDBM50202171
Substrate
Meas. Tech.
ChEMBL_438214 (CHEMBL907607)
IC50
>67000±n/a nM
Citation
 Bursavich, MGGilbert, AMLombardi, SGeorgiadis, KEReifenberg, EFlannery, CRMorris, EA Synthesis and evaluation of aryl thioxothiazolidinone inhibitors of ADAMTS-5 (Aggrecanase-2). Bioorg Med Chem Lett 17:1185-8 (2007)  
Target
Name:
A disintegrin and metalloproteinase with thrombospondin motifs 5
Synonyms:
A disintegrin and metalloproteinase with thrombospondin motifs 5 (ADAMTS-5) ADAMTS5 ATS5_HUMAN Metalloproteinase with thrombospondin motifs 5 (ADAMTS-5)
Type:
Enzyme
Mol. Mass.:
101769.09
Organism:
Homo sapiens (Human)
Description:
Q9UNA0
Residue:
930
  
Inhibitor
Name:
BDBM50202171
Synonyms:
5-(3,4-bis(benzyloxy)benzylidene)-3-phenethyl-2-thioxothiazolidin-4-one | CHEMBL230787
Type:
Small organic molecule
Emp. Form.:
C32H27NO3S2
Mol. Mass.:
537.692
SMILES:
O=C1N(CCc2ccccc2)C(=S)S\C1=C\c1ccc(OCc2ccccc2)c(OCc2ccccc2)c1
: