Target
Integrin alpha-IIb/beta-3
Ligand
BDBM50217427
Substrate
Meas. Tech.
ChEMBL_444673 (CHEMBL894922)
IC50
>50000±n/a nM
Citation
 Stragies, ROsterkamp, FZischinsky, GVossmeyer, DKalkhof, HReimer, UZahn, G Design and synthesis of a new class of selective integrin alpha5beta1 antagonists. J Med Chem 50:3786-94 (2007)  
Target
Name:
Integrin alpha-IIb/beta-3
Synonyms:
Glycoprotein IIb/IIIa
Type:
Mol. Mass.:
Description:
ASSAY_ID of EBI is 30109
Components:
This complex has 2 components.
Component 1
Name:
Integrin beta-3
Synonyms:
CD_antigen=CD61 GPIIIa ITGB3 Platelet membrane glycoprotein IIIa
Type:
Protein
Mol. Mass.:
87038.91
Organism:
Homo sapiens (Human)
Description:
P05106
Residue:
788
  
Component 2
Name:
Integrin alpha-IIb
Synonyms:
CD_antigen=CD41 GPIIb Glycoprotein IIb ITGA2B Integrin alpha-IIb heavy chain Integrin alpha-IIb light chain, form 2 Integrin alpha-V/beta-3 and alpha-IIb/beta 3 | Platelet membrane glycoprotein IIb
Type:
Protein
Mol. Mass.:
113354.85
Organism:
Homo sapiens (Human)
Description:
P08514
Residue:
1039
  
Inhibitor
Name:
BDBM50217427
Synonyms:
2S,3R,5S-3-{2-[1-(3,3-dimethyl-butyryl)-5-(pyridin-2-ylaminomethyl)-pyrrolidin-3-yloxy]-acetylamino}-2-[(1-methyl-cyclohexanecarbonyl)-amino]-propionic acid | CHEMBL389136
Type:
Small organic molecule
Emp. Form.:
C29H45N5O6
Mol. Mass.:
559.6975
SMILES:
CC(C)(C)CC(=O)N1C[C@@H](C[C@H]1CNc1ccccn1)OCC(=O)NC[C@H](NC(=O)C1(C)CCCCC1)C(O)=O
: