Target
Integrin alpha-V/beta-3
Ligand
BDBM50217427
Substrate
Meas. Tech.
ChEMBL_444671 (CHEMBL894920)
IC50
1600±n/a nM
Citation
 Stragies, ROsterkamp, FZischinsky, GVossmeyer, DKalkhof, HReimer, UZahn, G Design and synthesis of a new class of selective integrin alpha5beta1 antagonists. J Med Chem 50:3786-94 (2007)  
Target
Name:
Integrin alpha-V/beta-3
Synonyms:
ITGAV/ITGB3 | Integrin beta-3/Vitronectin receptor alpha
Type:
Enzyme
Mol. Mass.:
Description:
Components:
This complex has 2 components.
Component 1
Name:
Integrin alpha-V
Synonyms:
ITAV_HUMAN Integrin alpha-V/alpha-5 VNRA Vitronectin receptor | Vitronectin receptor subunit alpha
Type:
PROTEIN
Mol. Mass.:
116024.92
Organism:
Homo sapiens (Human)
Description:
ChEMBL_582336
Residue:
1048
  
Component 2
Name:
Integrin beta-3
Synonyms:
CD_antigen=CD61 GPIIIa ITGB3 Platelet membrane glycoprotein IIIa
Type:
Protein
Mol. Mass.:
87038.91
Organism:
Homo sapiens (Human)
Description:
P05106
Residue:
788
  
Inhibitor
Name:
BDBM50217427
Synonyms:
2S,3R,5S-3-{2-[1-(3,3-dimethyl-butyryl)-5-(pyridin-2-ylaminomethyl)-pyrrolidin-3-yloxy]-acetylamino}-2-[(1-methyl-cyclohexanecarbonyl)-amino]-propionic acid | CHEMBL389136
Type:
Small organic molecule
Emp. Form.:
C29H45N5O6
Mol. Mass.:
559.6975
SMILES:
CC(C)(C)CC(=O)N1C[C@@H](C[C@H]1CNc1ccccn1)OCC(=O)NC[C@H](NC(=O)C1(C)CCCCC1)C(O)=O
: