Target
Integrin alpha-5/beta-1
Ligand
BDBM50217427
Substrate
Meas. Tech.
ChEMBL_444670 (CHEMBL894919)
IC50
1.4±n/a nM
Citation
 Stragies, ROsterkamp, FZischinsky, GVossmeyer, DKalkhof, HReimer, UZahn, G Design and synthesis of a new class of selective integrin alpha5beta1 antagonists. J Med Chem 50:3786-94 (2007)  
Target
Name:
Integrin alpha-5/beta-1
Synonyms:
Fibronectin receptor alpha/beta ITGA5/ITGB1
Type:
Enzyme
Mol. Mass.:
Description:
Components:
This complex has 2 components.
Component 1
Name:
Integrin alpha-5
Synonyms:
CD49 antigen-like family member E FNRA Fibronectin receptor subunit alpha ITGA5 Integrin alpha-F | VLA-5
Type:
Single-pass type I membrane protein
Mol. Mass.:
114523.00
Organism:
Homo sapiens (Human)
Description:
Residue:
1049
  
Component 2
Name:
Integrin beta-1
Synonyms:
CD_antigen=CD29 Fibronectin receptor beta GPIIA ITGB1 MDF2 | MSK12
Type:
Enzyme
Mol. Mass.:
88400.38
Organism:
Homo sapiens (Human)
Description:
P05556
Residue:
798
  
Inhibitor
Name:
BDBM50217427
Synonyms:
2S,3R,5S-3-{2-[1-(3,3-dimethyl-butyryl)-5-(pyridin-2-ylaminomethyl)-pyrrolidin-3-yloxy]-acetylamino}-2-[(1-methyl-cyclohexanecarbonyl)-amino]-propionic acid | CHEMBL389136
Type:
Small organic molecule
Emp. Form.:
C29H45N5O6
Mol. Mass.:
559.6975
SMILES:
CC(C)(C)CC(=O)N1C[C@@H](C[C@H]1CNc1ccccn1)OCC(=O)NC[C@H](NC(=O)C1(C)CCCCC1)C(O)=O
: