Target
Integrin alpha-V/beta-5
Ligand
BDBM50217422
Substrate
Meas. Tech.
ChEMBL_444672 (CHEMBL894921)
IC50
29±n/a nM
Citation
 Stragies, ROsterkamp, FZischinsky, GVossmeyer, DKalkhof, HReimer, UZahn, G Design and synthesis of a new class of selective integrin alpha5beta1 antagonists. J Med Chem 50:3786-94 (2007)  
Target
Name:
Integrin alpha-V/beta-5
Synonyms:
ITGAV/ITGB5 | Integrin beta-5/Vitronectin receptor alpha
Type:
Enzyme
Mol. Mass.:
Description:
Components:
This complex has 2 components.
Component 1
Name:
Integrin alpha-V
Synonyms:
ITAV_HUMAN Integrin alpha-V/alpha-5 VNRA Vitronectin receptor | Vitronectin receptor subunit alpha
Type:
PROTEIN
Mol. Mass.:
116024.92
Organism:
Homo sapiens (Human)
Description:
ChEMBL_582336
Residue:
1048
  
Component 2
Name:
Integrin beta-5
Synonyms:
ITB5_HUMAN | ITGB5
Type:
PROTEIN
Mol. Mass.:
88047.37
Organism:
Homo sapiens (Human)
Description:
EBI_10915
Residue:
799
  
Inhibitor
Name:
BDBM50217422
Synonyms:
2S,3R,20S-3-(2-{1-(3,3-dimethyl-butyryl)-5-[(4-methoxy-pyridin-2-ylamino)-methyl]-pyrrolidin-3-yloxy}-acetylamino)-2-(2,4,6-trimethyl-benzenesulfonylamino)-propionic acid | CHEMBL396248
Type:
Small organic molecule
Emp. Form.:
C31H45N5O8S
Mol. Mass.:
647.783
SMILES:
COc1ccnc(NC[C@@H]2C[C@H](CN2C(=O)CC(C)(C)C)OCC(=O)NC[C@H](NS(=O)(=O)c2c(C)cc(C)cc2C)C(O)=O)c1
: