Target
Glutamate receptor ionotropic, NMDA 2B
Ligand
BDBM50220718
Substrate
Meas. Tech.
ChEMBL_449356 (CHEMBL899623)
IC50
856±n/a nM
Citation
 Kawai, MNakamura, HSakurada, IShimokawa, HTanaka, HMatsumizu, MAndo, KHattori, KOhta, ANukui, SOmura, AKawamura, M Discovery of novel and orally active NR2B-selective N-methyl-D-aspartate (NMDA) antagonists, pyridinol derivatives with reduced HERG binding affinity. Bioorg Med Chem Lett 17:5533-6 (2007)  
Target
Name:
Glutamate receptor ionotropic, NMDA 2B
Synonyms:
GluN2B Grin2b NMDA receptor subunit N2B (GluN2B) NMDE2_RAT | NR2B
Type:
Protein
Mol. Mass.:
166077.66
Organism:
Rattus norvegicus (Rat)
Description:
Q00960
Residue:
1482
  
Inhibitor
Name:
BDBM50220718
Synonyms:
CHEMBL236895 | N-((1r,4r)-4-(4-hydroxyphenyl)cyclohexyl)-3-(pyridin-2-yl)propanamide
Type:
Small organic molecule
Emp. Form.:
C20H24N2O2
Mol. Mass.:
324.4168
SMILES:
Oc1ccc(cc1)[C@H]1CC[C@@H](CC1)NC(=O)CCc1ccccn1
: