Target
Dipeptidyl peptidase 9
Ligand
BDBM50221982
Substrate
Meas. Tech.
ChEMBL_449745 (CHEMBL898848)
IC50
>100000±n/a nM
Citation
 Kaelin, DESmenton, ALEiermann, GJHe, HLeiting, BLyons, KAPatel, RAPatel, SBPetrov, AScapin, GWu, JKThornberry, NAWeber, AEDuffy, JL 4-arylcyclohexylalanine analogs as potent, selective, and orally active inhibitors of dipeptidyl peptidase IV. Bioorg Med Chem Lett 17:5806-11 (2007)  
Target
Name:
Dipeptidyl peptidase 9
Synonyms:
DPP9 DPRP-2 Dipeptidyl peptidase 9 (DDP9) Dipeptidyl peptidase 9 (DPP9) Dipeptidyl peptidase IX Dipeptidyl peptidase-like protein 9
Type:
Enzyme
Mol. Mass.:
98260.70
Organism:
Homo sapiens (Human)
Description:
Q86TI2
Residue:
863
  
Inhibitor
Name:
BDBM50221982
Synonyms:
CHEMBL237547 | N-((1S,4r)-4-((2S,3S)-3-amino-4-((S)-3-fluoropyrrolidin-1-yl)-4-oxobutan-2-yl)cyclohexyl)acetamide
Type:
Small organic molecule
Emp. Form.:
C16H28FN3O2
Mol. Mass.:
313.4108
SMILES:
C[C@H]([C@H](N)C(=O)N1CC[C@H](F)C1)[C@H]1CC[C@@H](CC1)NC(C)=O
: