Target
Mitogen-activated protein kinase 14
Ligand
BDBM50236475
Substrate
Meas. Tech.
ChEMBL_463023 (CHEMBL929947)
IC50
3.5±n/a nM
Citation
 Hynes, JWu, HPitt, SShen, DRZhang, RSchieven, GLGillooly, KMShuster, DJTaylor, TLYang, XMcIntyre, KWMcKinnon, MZhang, HMarathe, PHDoweyko, AMKish, KKiefer, SESack, JSNewitt, JABarrish, JCDodd, JLeftheris, K The discovery of (R)-2-(sec-butylamino)-N-(2-methyl-5-(methylcarbamoyl)phenyl) thiazole-5-carboxamide (BMS-640994)-A potent and efficacious p38alpha MAP kinase inhibitor. Bioorg Med Chem Lett 18:1762-7 (2008)  
Target
Name:
Mitogen-activated protein kinase 14
Synonyms:
CSAID-binding protein CSBP1 CSPB1 MAP kinase 14 MAP kinase p38 alpha MAPK14 MK14_HUMAN Mitogen-activated protein kinase p38 alpha Stress-activated protein kinase 2a | p38 MAP kinase alpha/beta
Type:
Serine/threonine-protein kinase
Mol. Mass.:
41286.76
Organism:
Homo sapiens (Human)
Description:
Q16539
Residue:
360
  
Inhibitor
Name:
BDBM50236475
Synonyms:
2-(isopropylamino)-N-(2-methyl-5-(methylcarbamoyl)phenyl)thiazole-5-carboxamide | CHEMBL258201
Type:
Small organic molecule
Emp. Form.:
C16H20N4O2S
Mol. Mass.:
332.421
SMILES:
CNC(=O)c1ccc(C)c(NC(=O)c2cnc(NC(C)C)s2)c1
: