Target
Protein kinase C epsilon type
Ligand
BDBM50269148
Substrate
Meas. Tech.
ChEMBL_528398 (CHEMBL974186)
IC50
54000±n/a nM
Citation
 Brauers, GEdrada, RAEbel, RProksch, PWray, VBerg, AGräfe, USchächtele, CTotzke, FFinkenzeller, GMarme, DKraus, JMünchbach, MMichel, MBringmann, GSchaumann, K Anthraquinones and betaenone derivatives from the sponge-associated fungus Microsphaeropsis species: novel inhibitors of protein kinases. J Nat Prod 63:739-45 (2000)  
Target
Name:
Protein kinase C epsilon type
Synonyms:
KPCE_MOUSE Pkcea Protein kinase C epsilon
Type:
PROTEIN
Mol. Mass.:
83566.28
Organism:
Mus musculus
Description:
ChEMBL_528398
Residue:
737
  
Inhibitor
Name:
BDBM50269148
Synonyms:
(R)-1,2,3,6,8-pentahydroxy-7-(1-methoxyethyl)anthracene-9,10-dione | CHEMBL498249
Type:
Small organic molecule
Emp. Form.:
C17H14O8
Mol. Mass.:
346.2883
SMILES:
CO[C@H](C)c1c(O)cc2C(=O)c3cc(O)c(O)c(O)c3C(=O)c2c1O
: