Target
Protein kinase C epsilon type
Ligand
BDBM50269147
Substrate
Meas. Tech.
ChEMBL_528398 (CHEMBL974186)
IC50
27000±n/a nM
Citation
 Brauers, GEdrada, RAEbel, RProksch, PWray, VBerg, AGräfe, USchächtele, CTotzke, FFinkenzeller, GMarme, DKraus, JMünchbach, MMichel, MBringmann, GSchaumann, K Anthraquinones and betaenone derivatives from the sponge-associated fungus Microsphaeropsis species: novel inhibitors of protein kinases. J Nat Prod 63:739-45 (2000)  
Target
Name:
Protein kinase C epsilon type
Synonyms:
KPCE_MOUSE Pkcea Protein kinase C epsilon
Type:
PROTEIN
Mol. Mass.:
83566.28
Organism:
Mus musculus
Description:
ChEMBL_528398
Residue:
737
  
Inhibitor
Name:
BDBM50269147
Synonyms:
(R)-1,3,6,8-tetrahydroxy-2-(1-methoxyethyl)anthracene-9,10-dione | CHEMBL498248
Type:
Small organic molecule
Emp. Form.:
C17H14O7
Mol. Mass.:
330.2889
SMILES:
CO[C@H](C)c1c(O)cc2C(=O)c3cc(O)cc(O)c3C(=O)c2c1O
: