Target
Beta-mannosidase
Ligand
BDBM50242267
Substrate
Meas. Tech.
ChEMBL_486583 (CHEMBL1020977)
IC50
93000±n/a nM
Citation
 Yasuda, KKizu, HYamashita, TKameda, YKato, ANash, RJFleet, GWMolyneux, RJAsano, N New sugar-mimic alkaloids from the pods of Angylocalyx pynaertii. J Nat Prod 65:198-202 (2002)  
Target
Name:
Beta-mannosidase
Synonyms:
MANBA_RAT | Manba
Type:
PROTEIN
Mol. Mass.:
101229.60
Organism:
Rattus norvegicus
Description:
ChEMBL_41368
Residue:
881
  
Inhibitor
Name:
BDBM50242267
Synonyms:
2,5-imino-1,2,5-trideoxy-D-mannitol | CHEMBL443158
Type:
Small organic molecule
Emp. Form.:
C6H13NO3
Mol. Mass.:
147.1723
SMILES:
C[C@H]1N[C@H](CO)[C@@H](O)[C@@H]1O
: