Target
Beta-mannosidase
Ligand
BDBM50278882
Substrate
Meas. Tech.
ChEMBL_545876 (CHEMBL1034391)
IC50
180000±n/a nM
Citation
 Yamashita, TYasuda, KKizu, HKameda, YWatson, AANash, RJFleet, GWAsano, N New polyhydroxylated pyrrolidine, piperidine, and pyrrolizidine alkaloids from Scilla sibirica. J Nat Prod 65:1875-81 (2002)  
Target
Name:
Beta-mannosidase
Synonyms:
MANBA_RAT | Manba
Type:
PROTEIN
Mol. Mass.:
101229.60
Organism:
Rattus norvegicus
Description:
ChEMBL_41368
Residue:
881
  
Inhibitor
Name:
BDBM50278882
Synonyms:
(2S,3S,4S,5S,6R)-2-((2R,3S,4S,5R,6R)-3,5-dihydroxy-2-((2R,3R,4R,5R)-4-hydroxy-2-(2-hydroxyethyl)-5-(hydroxymethyl)pyrrolidin-3-yloxy)-6-(hydroxymethyl)tetrahydro-2H-pyran-4-yloxy)-6-(hydroxymethyl)tetrahydro-2H-pyran-3,4,5-triol | CHEMBL522570
Type:
Small organic molecule
Emp. Form.:
C19H35NO14
Mol. Mass.:
501.4795
SMILES:
OCC[C@H]1N[C@H](CO)[C@@H](O)[C@@H]1O[C@@H]1O[C@H](CO)[C@@H](O)[C@H](O[C@@H]2O[C@H](CO)[C@@H](O)[C@H](O)[C@@H]2O)[C@@H]1O
: