Target
DNA polymerase beta
Ligand
BDBM50257635
Substrate
Meas. Tech.
ChEMBL_550647 (CHEMBL1002742)
IC50
26500±n/a nM
Citation
 Chaturvedula, VSGao, ZJones, SHFeng, XHecht, SMKingston, DG A new ursane triterpene from Monochaetum vulcanicum that inhibits DNA polymerase beta lyase. J Nat Prod 67:899-901 (2004)  
Target
Name:
DNA polymerase beta
Synonyms:
DNA polymerase beta (Pol β) POLB
Type:
Protein
Mol. Mass.:
38188.76
Organism:
Homo sapiens (Human)
Description:
Residue:
335
  
Inhibitor
Name:
BDBM50257635
Synonyms:
(-)-BETA-SITOSTEROL-BETA-D-GLUCOPYRANOSIDE (2R,3R,4S,5S,6R)-2-[[(3S,8S,9S,10R,13R,14S,17R)-17-[(2R,5R)-5-ETHYL-6-METHYLHEPTAN-2-YL]-10,13-DIMETHYL-2,3,4,7,8,9,11,12,14,15,16,17-DODECAHYDRO-1H-CYCLOPENTA[A]PHENANTHREN-3-YL]OXY]-6-(HYDROXYMETHYL)OXANE-3,4,5-TRIOL .BETA.-D-GLUCOPYRANOSIDE, (3.BETA.)-STIGMAST-5-EN-3-YL 474-58-8 ALEXANDRIN BETA-DAUCOSTEROL BETA-SITOSTEROL GLUCOSIDE BETA-SITOSTEROL-BETA-D-GLYCOSIDE BSSG CHEMBL506678 CORIANDRINOL DAUCOSTERIN DOURSTEROL EU-4906 LYONISIDE NSC165962 SITOGLUSIDE (USAN/INN) SITOSTEROL BETA-D-GLUCOSIDE SITOSTEROL-3-O-BETA-D-GLUCOSIDE SURECN137210 | WA 184
Type:
Small organic molecule
Emp. Form.:
C35H60O6
Mol. Mass.:
576.8473
SMILES:
CC[C@H](CC[C@@H](C)[C@H]1CC[C@H]2[C@@H]3CC=C4C[C@H](CC[C@]4(C)[C@H]3CC[C@]12C)O[C@@H]1O[C@H](CO)[C@@H](O)[C@H](O)[C@H]1O)C(C)C
: