Target
DNA polymerase beta
Ligand
BDBM50242088
Substrate
Meas. Tech.
ChEMBL_550598 (CHEMBL999199)
IC50
15300±n/a nM
Citation
 Prakash Chaturvedula, VSHecht, SMGao, ZJones, SHFeng, XKingston, DG New neolignans that inhibit DNA polymerase beta lyase. J Nat Prod 67:964-7 (2004)  
Target
Name:
DNA polymerase beta
Synonyms:
DNA polymerase beta (Pol β) POLB
Type:
Protein
Mol. Mass.:
38188.76
Organism:
Homo sapiens (Human)
Description:
Residue:
335
  
Inhibitor
Name:
BDBM50242088
Synonyms:
(7S,8R,1'S,5'S,6'R)-delta 2',8'-5',6'-Dihydroxy-3'-methoxy-3,4-methylenedioxy-4'-oxo-8.1',7.5'-neolignan | CHEMBL511272
Type:
Small organic molecule
Emp. Form.:
C20H22O6
Mol. Mass.:
358.3851
SMILES:
COC1=C[C@]2(CC=C)[C@H](C)[C@@H](c3ccc4OCOc4c3)[C@](O)([C@@H]2O)C1=O
: