Target
11-beta-hydroxysteroid dehydrogenase 1
Ligand
BDBM50260939
Substrate
Meas. Tech.
ChEMBL_552254 (CHEMBL995584)
IC50
0.98±n/a nM
Citation
 Zhu, YOlson, SHHermanowski-Vosatka, AMundt, SShah, KSpringer, MThieringer, RWright, SXiao, JZokian, HBalkovec, JM 4-Methyl-5-phenyl triazoles as selective inhibitors of 11beta-hydroxysteroid dehydrogenase type I. Bioorg Med Chem Lett 18:3405-11 (2008)  
Target
Name:
11-beta-hydroxysteroid dehydrogenase 1
Synonyms:
11-DH 11-beta-Hydroxysteroid Dehydrogenase 1 (11-beta-HSD1) 11-beta-hydroxysteroid dehydrogenase 1 (11HSD1) Corticosteroid 11-beta-dehydrogenase isozyme 1 (11-beta-HSD-1) Corticosteroid 11-beta-dehydrogenase isozyme 1 (11beta-HSD1) HSD11 HSD11L | SDR26C1
Type:
Enzyme
Mol. Mass.:
32409.16
Organism:
Homo sapiens (Human)
Description:
P28845
Residue:
292
  
Inhibitor
Name:
BDBM50260939
Synonyms:
3-(3-Chloro-3'-methanesulfonyl-biphenyl-4-yl)-5-[1-(4-chloro-phenyl)-cyclobutyl]-4-methyl-4H-[1,2,4]triazole | CHEMBL495889
Type:
Small organic molecule
Emp. Form.:
C26H23Cl2N3O2S
Mol. Mass.:
512.451
SMILES:
Cn1c(nnc1C1(CCC1)c1ccc(Cl)cc1)-c1ccc(cc1Cl)-c1cccc(c1)S(C)(=O)=O
: