Target
11-beta-hydroxysteroid dehydrogenase 1
Ligand
BDBM50261009
Substrate
Meas. Tech.
ChEMBL_552255 (CHEMBL995585)
IC50
0.98±n/a nM
Citation
 Zhu, YOlson, SHHermanowski-Vosatka, AMundt, SShah, KSpringer, MThieringer, RWright, SXiao, JZokian, HBalkovec, JM 4-Methyl-5-phenyl triazoles as selective inhibitors of 11beta-hydroxysteroid dehydrogenase type I. Bioorg Med Chem Lett 18:3405-11 (2008)  
Target
Name:
11-beta-hydroxysteroid dehydrogenase 1
Synonyms:
11-DH 11-beta-Hydroxysteroid Dehydrogenase 1 (11-beta-HSD1) 11beta-HSD1A Corticosteroid 11-beta-dehydrogenase isozyme 1 (11-beta-HSD-1) Hsd11 | Hsd11b1
Type:
Enzyme
Mol. Mass.:
32369.70
Organism:
Mus musculus (mouse)
Description:
P50172
Residue:
292
  
Inhibitor
Name:
BDBM50261009
Synonyms:
3-(3-Chloro-4'-ethanesulfonyl-biphenyl-4-yl)-5-[1-(4-chloro-phenyl)-cyclobutyl]-4-methyl-4H-[1,2,4]triazole | CHEMBL497555
Type:
Small organic molecule
Emp. Form.:
C27H25Cl2N3O2S
Mol. Mass.:
526.477
SMILES:
CCS(=O)(=O)c1ccc(cc1)-c1ccc(-c2nnc(n2C)C2(CCC2)c2ccc(Cl)cc2)c(Cl)c1
: