Target
Histamine H3 receptor
Ligand
BDBM50262939
Substrate
Meas. Tech.
ChEMBL_489014 (CHEMBL986355)
Ki
6.8±n/a nM
Citation
 Nagase, TMizutani, TIshikawa, SSekino, ESasaki, TFujimura, TIto, SMitobe, YMiyamoto, YYoshimoto, RTanaka, TIshihara, ATakenaga, NTokita, SFukami, TSato, N Synthesis, structure-activity relationships, and biological profiles of a quinazolinone class of histamine H3 receptor inverse agonists. J Med Chem 51:4780-9 (2008)  
Target
Name:
Histamine H3 receptor
Synonyms:
G-protein coupled receptor 97 HH3R HRH3 Histamine H3 receptor (H3) Histamine receptor (H3 and H4)
Type:
G Protein-Coupled Receptor (GPCR)
Mol. Mass.:
48691.47
Organism:
Homo sapiens (Human)
Description:
Binding assays were using CHO cells stably expressing hH3R receptors.
Residue:
445
  
Inhibitor
Name:
BDBM50262939
Synonyms:
2-Methyl-3-(4-{[3-(1-pyrrolidinyl)propyl]oxy}phenyl)-5-(trifluoromethyl)-4(3H)-quinazolinone | CHEMBL476323
Type:
Small organic molecule
Emp. Form.:
C23H24F3N3O2
Mol. Mass.:
431.4508
SMILES:
Cc1nc2cccc(c2c(=O)n1-c1ccc(OCCCN2CCCC2)cc1)C(F)(F)F
: