Target
Sodium channel protein type 2 subunit alpha
Ligand
BDBM50262566
Substrate
Meas. Tech.
ChEMBL_514329 (CHEMBL967147)
IC50
48±n/a nM
Citation
 Shishido, YWakabayashi, HKoike, HUeno, NNukui, SYamagishi, TMurata, YNaganeo, FMizutani, MShimada, KFujiwara, YSakakibara, ASuga, OKusano, RUeda, SKanai, YTsuchiya, MSatake, K Discovery and stereoselective synthesis of the novel isochroman neurokinin-1 receptor antagonist 'CJ-17,493'. Bioorg Med Chem 16:7193-205 (2008)  
Target
Name:
Sodium channel protein type 2 subunit alpha
Synonyms:
SCN2A_RAT Scn2a1 Sodium channel protein type 2 subunit alpha Sodium channel protein type II subunit alpha Voltage-gated sodium channel | Voltage-gated sodium channel subunit alpha Nav1.2
Type:
PROTEIN
Mol. Mass.:
227854.11
Organism:
Rattus norvegicus
Description:
ChEMBL_1516893
Residue:
2005
  
Inhibitor
Name:
BDBM50262566
Synonyms:
(2S,3S)-3-[(1R)-6-Methoxy-1-methyl-1-trifluoromethylisochroman-7-yl]methylamino-2-phenylpiperidine | CHEMBL478392
Type:
Small organic molecule
Emp. Form.:
C24H29F3N2O2
Mol. Mass.:
434.4945
SMILES:
COc1cc2CCO[C@](C)(c2cc1CN[C@H]1CCCN[C@H]1c1ccccc1)C(F)(F)F
: