Target
Cholecystokinin receptor type A
Ligand
BDBM50245195
Substrate
Meas. Tech.
ChEMBL_513418 (CHEMBL976505)
EC50
0.097±n/a nM
Citation
 Berger, RZhu, CHansen, ARHarper, BChen, ZHolt, TGHubert, JLee, SJPan, JQian, SReitman, MLStrack, AMWeingarth, DTWolff, MMacneil, DJWeber, AEEdmondson, SD 2-Substituted piperazine-derived imidazole carboxamides as potent and selective CCK1R agonists for the treatment of obesity. Bioorg Med Chem Lett 18:4833-7 (2008)  
Target
Name:
Cholecystokinin receptor type A
Synonyms:
CCK-A receptor CCK1-R CCKAR_HUMAN Cholecystokinin receptor Cholecystokinin-1 Receptor
Type:
G Protein-Coupled Receptor (GPCR)
Mol. Mass.:
47859.34
Organism:
Homo sapiens (Human)
Description:
Stable expression of human CCK-1 receptors in HEK 293 cells.
Residue:
428
  
Inhibitor
Name:
BDBM50245195
Synonyms:
2-(((R)-1-(1-(3-ethoxyphenyl)-2-p-tolyl-1H-imidazole-4-carbonyl)-4-(quinolin-3-yl)piperazin-2-yl)methoxy)acetic acid | CHEMBL508004
Type:
Small organic molecule
Emp. Form.:
C35H35N5O5
Mol. Mass.:
605.6829
SMILES:
CCOc1cccc(c1)-n1cc(nc1-c1ccc(C)cc1)C(=O)N1CCN(C[C@@H]1COCC(O)=O)c1cnc2ccccc2c1
: