Target
Protein kinase C alpha type
Ligand
BDBM50244738
Substrate
Meas. Tech.
ChEMBL_512395 (CHEMBL979906)
Ki
9.4±n/a nM
Citation
 Duan, DSigano, DMKelley, JALai, CCLewin, NEKedei, NPeach, MLLee, JAbeyweera, TPRotenberg, SAKim, HKim, YHEl Kazzouli, SChung, JUYoung, HAYoung, MRBaker, AColburn, NHHaimovitz-Friedman, ATruman, JPParrish, DADeschamps, JRPerry, NASurawski, RJBlumberg, PMMarquez, VE Conformationally constrained analogues of diacylglycerol. 29. Cells sort diacylglycerol-lactone chemical zip codes to produce diverse and selective biological activities. J Med Chem 51:5198-220 (2008)  
Target
Name:
Protein kinase C alpha type
Synonyms:
KPCA_MOUSE Prkca Protein kinase C alpha | Protein kinase C alpha type
Type:
Enzyme Catalytic Domain
Mol. Mass.:
76858.67
Organism:
MOUSE
Description:
Protein kinase C 0 MOUSE::P20444
Residue:
672
  
Inhibitor
Name:
BDBM50244738
Synonyms:
CHEMBL461936 | rac-(E/Z)-(4-(3-(trifluoromethyl)benzylidene)-2-(hydroxymethyl)-5-oxo-tetrahydrofuran-2-yl)methyl 2-ethylhexanoate
Type:
Small organic molecule
Emp. Form.:
C22H27F3O5
Mol. Mass.:
428.442
SMILES:
CCCCC(CC)C(=O)OCC1(CO)C\C(=C\c2cccc(c2)C(F)(F)F)C(=O)O1
: