Target
Dipeptidyl peptidase 9
Ligand
BDBM50050513
Substrate
Meas. Tech.
ChEMBL_538995 (CHEMBL1035669)
Ki
0.76±n/a nM
Citation
 Connolly, BASanford, DGChiluwal, AKHealey, SEPeters, DEDimare, MTWu, WLiu, YMaw, HZhou, YLi, YJin, ZSudmeier, JLLai, JHBachovchin, WW Dipeptide boronic acid inhibitors of dipeptidyl peptidase IV: determinants of potency and in vivo efficacy and safety. J Med Chem 51:6005-13 (2008)  
Target
Name:
Dipeptidyl peptidase 9
Synonyms:
DPP9 DPRP-2 Dipeptidyl peptidase 9 (DDP9) Dipeptidyl peptidase 9 (DPP9) Dipeptidyl peptidase IX Dipeptidyl peptidase-like protein 9
Type:
Enzyme
Mol. Mass.:
98260.70
Organism:
Homo sapiens (Human)
Description:
Q86TI2
Residue:
863
  
Inhibitor
Name:
BDBM50050513
Synonyms:
(R)-1-((S)-2-amino-3-methylbutanoyl)pyrrolidin-2-ylboronic acid (S)-2-Amino-3-methyl-2-boronic acid-1-pyrrolidin-1-yl-butan-1-one CHEMBL67279 Pyrrolidine derivative US11504364, Compound Val-boroPro US11707539, Compound 2054
Type:
Small organic molecule
Emp. Form.:
C9H19BN2O3
Mol. Mass.:
214.07
SMILES:
CC(C)[C@H](N)C(=O)N1CCC[C@H]1B(O)O
: