Target
Peroxisome proliferator-activated receptor gamma
Ligand
BDBM50275992
Substrate
Meas. Tech.
ChEMBL_496803 (CHEMBL1008816)
IC50
1439±n/a nM
Citation
 Lee, YZYang, CWKang, IJWu, SHChao, YSChern, JHLee, SJ Analogues of 2-phenyl-ethenesulfonic acid phenyl ester have dual functions of inhibiting expression of inducible nitric oxide synthase and activating peroxisome proliferator-activated receptor gamma. Bioorg Med Chem Lett 18:5676-9 (2008)  
Target
Name:
Peroxisome proliferator-activated receptor gamma
Synonyms:
NR1C3 PPAR-gamma PPARG_HUMAN Peroxisome proliferator-activated receptor gamma (PPAR gamma) Peroxisome proliferator-activated receptor gamma (PPARĪ³) peroxisome proliferator-activated receptor gamma isoform 2
Type:
Nuclear Receptor
Mol. Mass.:
57613.46
Organism:
Homo sapiens (Human)
Description:
P37231
Residue:
505
  
Inhibitor
Name:
BDBM50275992
Synonyms:
2,4,6-trichlorophenyl 2-phenylethenesulfonate | CHEMBL451531
Type:
Small organic molecule
Emp. Form.:
C14H9Cl3O3S
Mol. Mass.:
363.643
SMILES:
Clc1cc(Cl)c(OS(=O)(=O)\C=C\c2ccccc2)c(Cl)c1
: