Target
Small conductance calcium-activated potassium channel protein 2
Ligand
BDBM50275792
Substrate
Meas. Tech.
ChEMBL_497521 (CHEMBL995896)
IC50
1100±n/a nM
Citation
 Gentles, RGHu, SHuang, YGrant-Young, KPoss, MAAndres, CFiedler, TKnox, RLodge, NWeaver, CDHarden, DG Preliminary SAR studies on non-apamin-displacing 4-(aminomethylaryl)pyrrazolopyrimidine K(Ca) channel blockers. Bioorg Med Chem Lett 18:5694-7 (2008)  
Target
Name:
Small conductance calcium-activated potassium channel protein 2
Synonyms:
KCNN2 SK2
Type:
PROTEIN
Mol. Mass.:
63788.70
Organism:
Homo sapiens (Human)
Description:
ChEMBL_480083
Residue:
579
  
Inhibitor
Name:
BDBM50275792
Synonyms:
CHEMBL452406 | N-benzyl-5-chloropyrazolo[1,5-a]pyrimidin-7-amine
Type:
Small organic molecule
Emp. Form.:
C13H11ClN4
Mol. Mass.:
258.706
SMILES:
Clc1cc(NCc2ccccc2)n2nccc2n1
: