Target
Cannabinoid receptor 1
Ligand
BDBM50275366
Substrate
Meas. Tech.
ChEMBL_493369 (CHEMBL940410)
IC50
2.75±n/a nM
Citation
 Lee, SHSeo, HJLee, SHJung, MEPark, JHPark, HJYoo, JYun, HNa, JKang, SYSong, KSKim, MAChang, CHKim, JLee, J Biarylpyrazolyl oxadiazole as potent, selective, orally bioavailable cannabinoid-1 receptor antagonists for the treatment of obesity. J Med Chem 51:7216-33 (2009)  
Target
Name:
Cannabinoid receptor 1
Synonyms:
Brain-type cannabinoid receptor CB-R CNR1_RAT Cannabinoid receptor Cnr1 | Skr6
Type:
G Protein-Coupled Receptor (GPCR)
Mol. Mass.:
52856.55
Organism:
Rattus norvegicus (rat)
Description:
P20272
Residue:
473
  
Inhibitor
Name:
BDBM50275366
Synonyms:
2-(4-((1H-1,2,4-Triazol-1-yl)methyl)-5-(4-bromophenyl)-1-(2,4-dichlorophenyl)-1H-pyrazol-3-yl)-5-tert-butyl-1,3,4-oxadiazole | CHEMBL487178
Type:
Small organic molecule
Emp. Form.:
C24H20BrCl2N7O
Mol. Mass.:
573.272
SMILES:
CC(C)(C)c1nnc(o1)-c1nn(c(c1Cn1cncn1)-c1ccc(Br)cc1)-c1ccc(Cl)cc1Cl
: