Target
Cannabinoid receptor 1
Ligand
BDBM50275480
Substrate
Meas. Tech.
ChEMBL_493369 (CHEMBL940410)
IC50
1.51±n/a nM
Citation
 Lee, SHSeo, HJLee, SHJung, MEPark, JHPark, HJYoo, JYun, HNa, JKang, SYSong, KSKim, MAChang, CHKim, JLee, J Biarylpyrazolyl oxadiazole as potent, selective, orally bioavailable cannabinoid-1 receptor antagonists for the treatment of obesity. J Med Chem 51:7216-33 (2009)  
Target
Name:
Cannabinoid receptor 1
Synonyms:
Brain-type cannabinoid receptor CB-R CNR1_RAT Cannabinoid receptor Cnr1 | Skr6
Type:
G Protein-Coupled Receptor (GPCR)
Mol. Mass.:
52856.55
Organism:
Rattus norvegicus (rat)
Description:
P20272
Residue:
473
  
Inhibitor
Name:
BDBM50275480
Synonyms:
2-(4-((1H-1,2,4-Triazol-1-yl)methyl)-5-(4-chlorophenyl)-1-(2,4-dichlorophenyl)-1H-pyrazol-3-yl)-5-(1-(trifluoromethyl)cyclopropyl)-1,3,4-oxadiazole | CHEMBL530339
Type:
Small organic molecule
Emp. Form.:
C24H15Cl3F3N7O
Mol. Mass.:
580.776
SMILES:
FC(F)(F)C1(CC1)c1nnc(o1)-c1nn(c(c1Cn1cncn1)-c1ccc(Cl)cc1)-c1ccc(Cl)cc1Cl
: