Target
Cannabinoid receptor 1
Ligand
BDBM50275401
Substrate
Meas. Tech.
ChEMBL_493369 (CHEMBL940410)
IC50
22.6±n/a nM
Citation
 Lee, SHSeo, HJLee, SHJung, MEPark, JHPark, HJYoo, JYun, HNa, JKang, SYSong, KSKim, MAChang, CHKim, JLee, J Biarylpyrazolyl oxadiazole as potent, selective, orally bioavailable cannabinoid-1 receptor antagonists for the treatment of obesity. J Med Chem 51:7216-33 (2009)  
Target
Name:
Cannabinoid receptor 1
Synonyms:
Brain-type cannabinoid receptor CB-R CNR1_RAT Cannabinoid receptor Cnr1 | Skr6
Type:
G Protein-Coupled Receptor (GPCR)
Mol. Mass.:
52856.55
Organism:
Rattus norvegicus (rat)
Description:
P20272
Residue:
473
  
Inhibitor
Name:
BDBM50275401
Synonyms:
2-(3-(5-tert-Butyl-1,3,4-oxadiazol-2-yl)-5-(4-chlorophenyl)-1-(2,4-dichlorophenyl)-1H-pyrazol-4-yl)propan-2-ol | CHEMBL519875
Type:
Small organic molecule
Emp. Form.:
C24H23Cl3N4O2
Mol. Mass.:
505.824
SMILES:
CC(C)(C)c1nnc(o1)-c1nn(c(c1C(C)(C)O)-c1ccc(Cl)cc1)-c1ccc(Cl)cc1Cl
: