Target
Cannabinoid receptor 1
Ligand
BDBM50275466
Substrate
Meas. Tech.
ChEMBL_493369 (CHEMBL940410)
IC50
16.9±n/a nM
Citation
 Lee, SHSeo, HJLee, SHJung, MEPark, JHPark, HJYoo, JYun, HNa, JKang, SYSong, KSKim, MAChang, CHKim, JLee, J Biarylpyrazolyl oxadiazole as potent, selective, orally bioavailable cannabinoid-1 receptor antagonists for the treatment of obesity. J Med Chem 51:7216-33 (2009)  
Target
Name:
Cannabinoid receptor 1
Synonyms:
Brain-type cannabinoid receptor CB-R CNR1_RAT Cannabinoid receptor Cnr1 | Skr6
Type:
G Protein-Coupled Receptor (GPCR)
Mol. Mass.:
52856.55
Organism:
Rattus norvegicus (rat)
Description:
P20272
Residue:
473
  
Inhibitor
Name:
BDBM50275466
Synonyms:
2-tert-Butyl-5-(5-(4-chlorophenyl)-1-(2,4-dichlorophenyl)-4-vinyl-1H-pyrazol-3-yl)-1,3,4-oxadiazole | CHEMBL521216
Type:
Small organic molecule
Emp. Form.:
C23H19Cl3N4O
Mol. Mass.:
473.782
SMILES:
CC(C)(C)c1nnc(o1)-c1nn(c(c1C=C)-c1ccc(Cl)cc1)-c1ccc(Cl)cc1Cl
: