Target
Cannabinoid receptor 1
Ligand
BDBM50275399
Substrate
Meas. Tech.
ChEMBL_493369 (CHEMBL940410)
IC50
10.1±n/a nM
Citation
 Lee, SHSeo, HJLee, SHJung, MEPark, JHPark, HJYoo, JYun, HNa, JKang, SYSong, KSKim, MAChang, CHKim, JLee, J Biarylpyrazolyl oxadiazole as potent, selective, orally bioavailable cannabinoid-1 receptor antagonists for the treatment of obesity. J Med Chem 51:7216-33 (2009)  
Target
Name:
Cannabinoid receptor 1
Synonyms:
Brain-type cannabinoid receptor CB-R CNR1_RAT Cannabinoid receptor Cnr1 | Skr6
Type:
G Protein-Coupled Receptor (GPCR)
Mol. Mass.:
52856.55
Organism:
Rattus norvegicus (rat)
Description:
P20272
Residue:
473
  
Inhibitor
Name:
BDBM50275399
Synonyms:
1-(3-(5-tert-Butyl-1,3,4-oxadiazol-2-yl)-5-(4-chlorophenyl)-1-(2,4-dichlorophenyl)-1H-pyrazol-4-yl)ethanol | CHEMBL487161
Type:
Small organic molecule
Emp. Form.:
C23H21Cl3N4O2
Mol. Mass.:
491.797
SMILES:
CC(O)c1c(nn(c1-c1ccc(Cl)cc1)-c1ccc(Cl)cc1Cl)-c1nnc(o1)C(C)(C)C
: