Target
Cannabinoid receptor 1
Ligand
BDBM50275384
Substrate
Meas. Tech.
ChEMBL_493369 (CHEMBL940410)
IC50
14.7±n/a nM
Citation
 Lee, SHSeo, HJLee, SHJung, MEPark, JHPark, HJYoo, JYun, HNa, JKang, SYSong, KSKim, MAChang, CHKim, JLee, J Biarylpyrazolyl oxadiazole as potent, selective, orally bioavailable cannabinoid-1 receptor antagonists for the treatment of obesity. J Med Chem 51:7216-33 (2009)  
Target
Name:
Cannabinoid receptor 1
Synonyms:
Brain-type cannabinoid receptor CB-R CNR1_RAT Cannabinoid receptor Cnr1 | Skr6
Type:
G Protein-Coupled Receptor (GPCR)
Mol. Mass.:
52856.55
Organism:
Rattus norvegicus (rat)
Description:
P20272
Residue:
473
  
Inhibitor
Name:
BDBM50275384
Synonyms:
2-(5-(4-Chlorophenyl)-1-(2,4-dichlorophenyl)-4-methyl-1Hpyrazol-3-yl)-5-(2-methylhexan-2-yl)-1,3,4-oxadiazole | CHEMBL487772
Type:
Small organic molecule
Emp. Form.:
C25H25Cl3N4O
Mol. Mass.:
503.851
SMILES:
CCCCC(C)(C)c1nnc(o1)-c1nn(c(c1C)-c1ccc(Cl)cc1)-c1ccc(Cl)cc1Cl
: