Target
A disintegrin and metalloproteinase with thrombospondin motifs 5
Ligand
BDBM50256059
Substrate
Meas. Tech.
ChEMBL_519272 (CHEMBL946711)
IC50
1000±n/a nM
Citation
 Gilbert, AMBursavich, MGLombardi, SGeorgiadis, KEReifenberg, EFlannery, CRMorris, EA N-((8-hydroxy-5-substituted-quinolin-7-yl)(phenyl)methyl)-2-phenyloxy/amino-acetamide inhibitors of ADAMTS-5 (Aggrecanase-2). Bioorg Med Chem Lett 18:6454-7 (2008)  
Target
Name:
A disintegrin and metalloproteinase with thrombospondin motifs 5
Synonyms:
A disintegrin and metalloproteinase with thrombospondin motifs 5 (ADAMTS-5) ADAMTS5 ATS5_HUMAN Metalloproteinase with thrombospondin motifs 5 (ADAMTS-5)
Type:
Enzyme
Mol. Mass.:
101769.09
Organism:
Homo sapiens (Human)
Description:
Q9UNA0
Residue:
930
  
Inhibitor
Name:
BDBM50256059
Synonyms:
CHEMBL481505 N-((5-chloro-8-hydroxyquinolin-7-yl)(4-methoxyphenyl)methyl)-2-phenoxyacetamide
Type:
Small organic molecule
Emp. Form.:
C25H21ClN2O4
Mol. Mass.:
448.898
SMILES:
COc1ccc(cc1)C(NC(=O)COc1ccccc1)c1cc(Cl)c2cccnc2c1O
: